{"text_format":"1","workbook":"xlsx","n_sheets":3,"sheets":["MxL7704","Simple Data","PLXDAQ_new_Settings"],"not_rendered":{"charts":3,"images":1,"macros":1,"external_links":0,"defined_names":11,"comments":0,"pivot_tables":0},"unopened":[],"bounds":{"document_bytes":16777216,"sheet_cells":100000,"rows_first":2000,"rows_last":500,"rows_between":2000,"halvings":0,"cell_chars":16384,"cell_head_chars":4096},"cells_cut":0,"cells_raw":0,"read":"whole","date_system":"1900"}

{"sheet":"MxL7704","index":0,"n_rows":257,"n_cols":33,"rows_kept":257,"cut":false,"hidden":false,"merged":[[112,1,112,2],[112,13,112,14],[112,16,112,17],[23,1,23,2],[24,1,24,2],[25,1,25,2],[26,1,26,2],[28,1,28,2],[110,1,110,2],[110,3,110,4],[110,5,110,6],[110,13,110,14],[110,16,110,17],[111,1,111,2],[111,3,111,4],[111,5,111,6],[111,13,111,14],[107,1,107,2],[107,3,107,4],[107,5,107,6],[107,13,107,14],[107,16,107,17],[111,16,111,17],[108,1,108,2],[108,3,108,4],[108,5,108,6],[108,13,108,14],[108,16,108,17],[109,1,109,2],[109,3,109,4],[109,5,109,6],[109,13,109,14],[109,16,109,17],[105,1,105,2],[105,3,105,4],[105,5,105,6],[105,13,105,14],[105,16,105,17],[106,1,106,2],[106,3,106,4],[106,5,106,6],[106,13,106,14],[106,16,106,17],[103,3,103,4],[103,5,103,6],[103,7,103,8],[103,9,103,10],[103,11,103,12],[103,13,103,14],[103,16,103,17],[104,1,104,2],[104,3,104,4],[104,5,104,6],[104,13,104,14],[104,16,104,17],[102,1,102,2],[102,3,102,4],[102,5,102,6],[102,7,102,8],[102,9,102,10],[102,11,102,12],[100,13,100,14],[100,16,100,17],[101,1,101,2],[101,3,101,4],[101,5,101,6],[101,7,101,8],[101,9,101,10],[101,11,101,12],[101,13,101,14],[101,16,101,17],[100,1,100,2],[100,3,100,4],[100,5,100,6],[100,7,100,8],[100,9,100,10],[100,11,100,12],[102,13,102,14],[102,16,102,17],[98,13,98,14],[98,16,98,17],[99,1,99,2],[99,3,99,4],[99,5,99,6],[99,7,99,8],[99,9,99,10],[99,11,99,12],[99,13,99,14],[99,16,99,17],[98,1,98,2],[98,3,98,4],[98,5,98,6],[98,7,98,8],[98,9,98,10],[98,11,98,12],[96,13,96,14],[96,16,96,17],[97,1,97,2],[97,3,97,4],[97,5,97,6],[97,7,97,8],[97,9,97,10],[97,11,97,12],[97,13,97,14],[97,16,97,17],[96,1,96,2],[96,3,96,4],[96,5,96,6],[96,7,96,8],[96,9,96,10],[96,11,96,12],[94,13,94,14],[94,16,94,17],[95,1,95,2],[95,3,95,4],[95,5,95,6],[95,7,95,8],[95,9,95,10],[95,11,95,12],[95,13,95,14],[95,16,95,17],[94,1,94,2],[94,3,94,4],[94,5,94,6],[94,7,94,8],[94,9,94,10],[94,11,94,12],[92,13,92,14],[92,16,92,17],[93,1,93,2],[93,3,93,4],[93,5,93,6],[93,7,93,8],[93,9,93,10],[93,11,93,12],[93,13,93,14],[93,16,93,17],[92,1,92,2],[92,3,92,4],[92,5,92,6],[92,7,92,8],[92,9,92,10],[92,11,92,12],[90,13,90,14],[90,16,90,17],[91,1,91,2],[91,3,91,4],[91,5,91,6],[91,7,91,8],[91,9,91,10],[91,11,91,12],[91,13,91,14],[91,16,91,17],[90,1,90,2],[90,3,90,4],[90,5,90,6],[90,7,90,8],[90,9,90,10],[90,11,90,12],[88,13,88,14],[88,16,88,17],[89,1,89,2],[89,3,89,4],[89,5,89,6],[89,7,89,8],[89,9,89,10],[89,11,89,12],[89,13,89,14],[89,16,89,17],[88,1,88,2],[88,3,88,4],[88,5,88,6],[88,7,88,8],[88,9,88,10],[88,11,88,12],[86,13,86,14],[86,16,86,17],[87,1,87,2],[87,3,87,4],[87,5,87,6],[87,7,87,8],[87,9,87,10],[87,11,87,12],[87,13,87,14],[87,16,87,17],[86,1,86,2],[86,3,86,4],[86,5,86,6],[86,7,86,8],[86,9,86,10],[86,11,86,12],[84,13,84,14],[84,16,84,17],[85,1,85,2],[85,3,85,4],[85,5,85,6],[85,7,85,8],[85,9,85,10],[85,11,85,12],[85,13,85,14],[85,16,85,17],[84,1,84,2],[84,3,84,4],[84,5,84,6],[84,7,84,8],[84,9,84,10],[84,11,84,12],[82,13,82,14],[82,16,82,17],[83,1,83,2],[83,3,83,4],[83,5,83,6],[83,7,83,8],[83,9,83,10],[83,11,83,12],[83,13,83,14],[83,16,83,17],[82,1,82,2],[82,3,82,4],[82,5,82,6],[82,7,82,8],[82,9,82,10],[82,11,82,12],[78,5,78,8],[78,9,78,11],[78,12,78,14],[79,5,79,8],[79,9,79,11],[79,12,79,14],[76,5,76,8],[76,9,76,11],[76,12,76,14],[77,5,77,8],[77,9,77,11],[77,12,77,14],[74,1,74,4],[74,5,74,8],[74,9,74,11],[74,12,74,14],[75,1,75,4],[75,5,75,8],[75,9,75,11],[75,12,75,14],[72,1,72,4],[72,5,72,8],[72,9,72,11],[72,12,72,14],[73,1,73,4],[73,5,73,8],[73,9,73,11],[73,12,73,14],[70,1,70,4],[70,5,70,8],[70,9,70,11],[70,12,70,14],[71,1,71,4],[71,5,71,8],[71,9,71,11],[71,12,71,14],[64,6,64,8],[65,6,65,8],[67,1,67,16],[69,1,69,4],[69,5,69,8],[69,9,69,11],[69,12,69,14],[48,6,48,8],[48,12,48,14],[49,6,49,8],[49,12,49,14],[62,0,62,17],[63,6,63,8],[45,6,45,8],[45,12,45,14],[46,6,46,8],[46,12,46,14],[47,6,47,8],[47,12,47,14],[18,6,18,8],[18,9,18,11],[18,13,18,17],[26,6,26,8],[26,12,26,14],[28,6,28,8],[28,12,28,14],[30,4,30,8],[44,0,44,17],[22,0,22,17],[23,6,23,8],[23,12,23,14],[24,6,24,8],[24,12,24,14],[25,6,25,8],[25,12,25,14],[23,3,23,5],[24,3,24,5],[25,3,25,5],[26,3,26,5],[28,3,28,5],[113,0,113,17],[118,0,118,8],[14,4,14,8],[14,9,14,11],[15,0,15,17],[16,6,16,8],[16,9,16,11],[16,13,16,17],[1,6,4,16],[6,1,6,16],[8,9,8,11],[10,9,10,11],[10,12,10,13],[12,6,12,8],[12,12,12,14],[19,6,19,8],[19,9,19,11],[19,13,19,17],[21,6,21,8],[21,9,21,11],[21,13,21,17],[17,6,17,8],[17,9,17,11],[17,13,17,17]]}
[null,null,null,null,null,null,null,null,null,null,null,null,null,null,null,null,null,null," BK Freq","VMIN","VMAX","BK1 Vref","BK1 Vout","BK2 Vref","BK2 Vout","BK3 Vref","BK3 Vout","BK4 Vref","BK4 Vout","LDO Vout","Enable"]
[null,null,null,null,null,null,"MXL7704 Five Output Universal PMIC with I2C Interface and 8-bit ADC",null,null,null,null,null,null,null,null,null,null,null,{"$f":"J15","v":1},{"$f":" IF(J13=\"--\",0,J13)","v":4.25},{"$f":"IF(L13=\"--\",30,L13)","v":5.5},0,{"$f":"IF(V2>(T2-0.8),\"--\",V2)","v":0},0,{"$f":"IF(X2<(U2*S2*0.12),\"--\",X2)","v":"--"},0,{"$f":"IF(Z2<(U2*S2*0.12),\"--\",Z2)","v":"--"},0,{"$f":"IF(AB2<(U2*S2*0.12),\"--\",AB2)","v":"--"},0,"ON"]
[null,null,null,null,null,null,null,null,null,null,null,null,null,null,null,null,null,null,{"$f":" S2","v":1},{"$f":" T2","v":4.25},{"$f":" U2","v":5.5},0.02,{"$f":"IF(V3>(T3-0.8),\"--\",V3)","v":0.02},0.02,{"$f":"IF(X3<(U3*S3*0.12),\"--\",X3)","v":"--"},6.2500000000000003E-3,{"$f":"IF(Z3<(U3*S3*0.12),\"--\",Z3)","v":"--"},6.2500000000000003E-3,{"$f":"IF(AB3<(U3*S3*0.12),\"--\",AB3)","v":"--"},0.02,"OFF"]
[null,null,null,null,null,null,null,null,null,null,null,null,null,null,null,null,null,null,{"$f":" S3","v":1},4.25,5.5,0.04,0.04,0.04,"--",1.2500000000000001E-2,"--",1.2500000000000001E-2,"--",0.04]
[null,null,null,null,null,null,null,null,null,null,null,null,null,null,null,null,null,null,1,4.25,5.5,0.06,0.06,0.06,"--",1.8749999999999999E-2,"--",1.8749999999999999E-2,"--",0.06,"Group"]
[null,null,null,null,null,null,null,null,null,null,null,null,null,null,null,null,null,null,1,4.25,5.5,0.08,0.08,0.08,"--",2.5000000000000001E-2,"--",2.5000000000000001E-2,"--",0.08,0]
[null,"MxL7704 Configuration Tool ",null,null,null,null,null,null,null,null,null,null,null,null,null,null,null,null,1,4.25,5.5,0.1,0.1,0.1,"--",3.125E-2,"--",3.125E-2,"--",0.1,1]
[null,null,null,null,null,null,null,null,null,null,null,null,null,null,null,null,"Revision 2.0",null,1,4.25,5.5,0.12,0.12,0.12,"--",3.7499999999999999E-2,"--",3.7499999999999999E-2,"--",0.12,2]
[null,null,null,null,null,null,null,"Device Name",null,"MXL7704",null,null,null,null,null,null,null,null,1,4.25,5.5,0.14000000000000001,0.14000000000000001,0.14000000000000001,"--",4.3749999999999997E-2,"--",4.3749999999999997E-2,"--",0.14000000000000001,3]
[null,null,null,null,null,null,null,null,null,null,null,null,null,null,null,null,null,null,1,4.25,5.5,0.16,0.16,0.16,"--",0.05,"--",0.05,"--",0.16]
[null,null,null,null,null,null,null,"Number of Channels",null,5,null,null,"Channels",null,null,null,null,null,1,4.25,5.5,0.18,0.18,0.18,"--",5.6250000000000001E-2,"--",5.6250000000000001E-2,"--",0.18]
[null,null,null,null,null,null,null,null,null,null,null,null,null,null,null,null,null,null,{"$f":" S11","v":1},{"$f":" T11","v":4.25},{"$f":" U11","v":5.5},0.2,0.2,0.2,"--",6.25E-2,"--",6.25E-2,"--",0.2]
[null,null,null,null,null,null,"VIN Min",null,null,4.25,"V",5.5,"V       VIN Max",null,null,null,null,null,1,4.25,5.5,0.22,0.22,0.22,"--",6.8750000000000006E-2,"--",6.8750000000000006E-2,"--",0.22]
[null,null,null,null,null,null,null,null,null,null,null,null,null,null,null,null,null,null,1,4.25,5.5,0.24,0.24,0.24,"--",7.4999999999999997E-2,"--",7.4999999999999997E-2,"--",0.24]
[null,null,null,null,"Buck Switching Frequency ",null,null,null,null,1,null,null,"MHz",null,null,null,null,null,1,4.25,5.5,0.26,0.26,0.26,"--",8.1250000000000003E-2,"--",8.1250000000000003E-2,"--",0.26]
["                                                                         Output Voltage",null,null,null,null,null,null,null,null,null,null,null,null,null,null,null,null,null,1,4.25,5.5,0.28000000000000003,0.28000000000000003,0.28000000000000003,"--",8.7499999999999994E-2,"--",8.7499999999999994E-2,"--",0.28000000000000003]
[null,null,null,null,null,null,"Buck 1",null,null,3.46,null,null,{"$f":" IF(J17=\"--\",\"V  =>\",IF(J17>(T17-0.8),\"V  =>\",\"V\"))","v":"V  =>"},{"$f":" IF(J17=\"--\",\"See DS for LOW VIN\",IF(J17>(T17-0.8),\"See DS for LOW VIN\",\"\"))","v":"See DS for LOW VIN"},null,null,null,null,1,4.25,5.5,0.3,0.3,0.3,"--",9.375E-2,"--",9.375E-2,"--",0.3]
[null,null,null,null,null,null,"Buck 2",null,null,1.8,null,null,{"$f":" IF(J18=\"--\",\"V  =>\",IF(J18<(U18*S18*0.12),\"V  =>\",\"V\"))","v":"V"},{"$f":" IF(J18=\"--\",\"MIN-ON-TIME VIOLATED\",IF(J18<(U18*S18*0.12),\"MIN-ON-TIME VIOLATED\",\"\"))","v":""},null,null,null,null,1,4.25,5.5,0.32,0.32,0.32,"--",0.1,"--",0.1,"--",0.32]
[null,null,null,null,null,null,"Buck 3",null,null,1.5,null,null,{"$f":" IF(J19=\"--\",\"V  =>\",IF(J19<(U19*S19*0.12),\"V  =>\",\"V\"))","v":"V"},{"$f":" IF(J19=\"--\",\"MIN-ON-TIME VIOLATED\",IF(J19<(U19*S19*0.12),\"MIN-ON-TIME VIOLATED\",\"\"))","v":""},null,null,null,null,1,4.25,5.5,0.34,0.34,0.34,"--",0.10625,"--",0.10625,"--",0.34]
[null,null,null,null,null,null,"Buck 4",null,null,0.9,null,null,{"$f":" IF(J20=\"--\",\"V  =>\",IF(J20<(U20*S20*0.12),\"V  =>\",\"V\"))","v":"V"},{"$f":" IF(J20=\"--\",\"MIN-ON-TIME VIOLATED\",IF(J20<(U20*S20*0.12),\"MIN-ON-TIME VIOLATED\",\"\"))","v":""},null,null,null,null,{"$f":" S19","v":1},4.25,5.5,0.36,0.36,0.36,"--",0.1125,"--",0.1125,"--",0.36]
[null,null,null,null,null,null,null,null,null,null,null,null,null,null,null,null,null,null,1,4.25,5.5,0.38,0.38,0.38,"--",0.11874999999999999,"--",0.11874999999999999,"--",0.38]
[null,null,null,null,null,null,"LDO",null,null,3.34,null,null,"V",null,null,null,null,null,1,4.25,5.5,0.4,0.4,0.4,"--",0.125,"--",0.125,"--",0.4]
["                                                 Sequencing Group        Channel Enable",null,null,null,null,null,null,null,null,null,null,null,null,null,null,null,null,null,1,4.25,5.5,0.42,0.42,0.42,"--",0.13125000000000001,"--",0.13125000000000001,"--",0.42,"Freq"]
[null,"VOUT1",null,"3.0V to 3.6V Max=1.5A",null,null,"Buck 1",null,null,2,null,"ON","Buck 1",null,null,null,null,null,1,4.25,5.5,0.44,0.44,0.44,"--",0.13750000000000001,"--",0.13750000000000001,"--",0.44,1]
[null,"VOUT2",null,"1.3V to 1.9V Max=1.5A",null,null,"Buck 2",null,null,3,null,"ON","Buck 2",null,null,null,null,null,1,4.25,5.5,0.46,0.46,0.46,"--",0.14374999999999999,"--",0.14374999999999999,"--",0.46,1.1000000000000001]
[null,"VOUT3",null,"0.8V to 1.6V  Max=2.5A",null,null,"Buck 3",null,null,1,null,"ON","Buck 3",null,null,null,null,null,1,4.25,5.5,0.48,0.48,0.48,"--",0.15,"--",0.15,"--",0.48,1.2]
[null,"VOUT4",null,"0.6V to 1.4V  Max=4A",null,null,"Buck 4",null,null,0,null,"ON","Buck 4",null,null,null,null,null,1,4.25,5.5,0.5,0.5,0.5,"--",0.15625,"--",0.15625,"--",0.5,1.3]
[null,null,null,null,null,null,null,null,null,null,null,null,null,null,null,null,null,null,1,4.25,5.5,0.52,0.52,0.52,"--",0.16250000000000001,"--",0.16250000000000001,"--",0.52,1.4]
[null,"LDO",null," 1.5V to 3.6V  Max=0.1A ",null,null,"LDO",null,null,2,null,"ON","LDO",null,null,null,null,null,1,4.25,5.5,0.54,0.54,0.54,"--",0.16875000000000001,"--",0.16875000000000001,"--",0.54,1.5]
[null,null,null,null,null,null,null,null,null,null,null,null,null,null,null,null,null,null,1,4.25,5.5,0.56000000000000005,0.56000000000000005,0.56000000000000005,"--",0.17499999999999999,"--",0.17499999999999999,"--",0.56000000000000005,1.6]
[null,null,null,null,"SEQ_EN Group Assign",null,null,null,null,1,null,null,null,null,null,null,null,null,1,4.25,5.5,0.57999999999999996,0.57999999999999996,0.57999999999999996,"--",0.18124999999999999,"--",0.18124999999999999,"--",0.57999999999999996,1.7]
[null,null,null,null,null,null,null,null,null,null,null,null,null,null,null,null,null,null,1,4.25,5.5,0.6,0.6,0.6,"--",0.1875,"--",0.1875,"--",0.6,1.8]
[null,null,null,null,null,null,null,null,null,null,null,null,null,null,null,null,null,null,1,4.25,5.5,0.62,0.62,0.62,"--",0.19375000000000001,"--",0.19375000000000001,"--",0.62,1.9]
[null,null,null,null,null,null,null,null,null,null,null,null,null,null,null,null,null,null,1,4.25,5.5,0.64,0.64,0.64,"--",0.2,"--",0.2,"--",0.64,2]
[null,null,null,null,null,null,null,null,null,null,null,null,null,null,null,null,null,null,1,4.25,5.5,0.66,0.66,0.66,0.66,0.20624999999999999,"--",0.20624999999999999,"--",0.66,2.1]
[null,null,null,null,null,null,null,null,null,null,null,null,null,null,null,null,null,null,{"$f":" S35","v":1},4.25,5.5,0.68,0.68,0.68,0.68,0.21249999999999999,"--",0.21249999999999999,"--",0.68]
[null,null,null,null,null,null,null,null,null,null,null,null,null,null,null,null,null,null,1,4.25,5.5,0.7,0.7,0.7,0.7,0.21875,"--",0.21875,"--",0.7,"Vin Ref","Vin MAX","Vin MIN"]
[null,null,null,null,null,null,null,null,null,null,null,null,null,null,null,null,null,null,1,4.25,5.5,0.72,0.72,0.72,0.72,0.22500000000000001,"--",0.22500000000000001,"--",0.72,4,{"$f":" IF(AE38<T38, \"--\",AE38)","v":"--"},{"$f":" IF(U38<AE38,\"--\",AE38)","v":4}]
[null,null,null,null,null,null,null,null,null,null,null,null,null,null,null,null,null,null,1,4.25,5.5,0.74,0.74,0.74,0.74,0.23125000000000001,"--",0.23125000000000001,"--",0.74,{"$f":"AE38+0.25","v":4.25},{"$f":" IF(AE39<T39, \"--\",AE39)","v":4.25},{"$f":" IF(U39<AE39,\"--\",AE39)","v":4.25}]
[null,null,null,null,null,null,null,null,null,null,null,null,null,null,null,null,null,null,1,4.25,5.5,0.76,0.76,0.76,0.76,0.23749999999999999,"--",0.23749999999999999,"--",0.76,{"$f":"AE39+0.25","v":4.5},4.5,4.5]
[null,null,null,null,null,null,null,null,null,null,null,null,null,null,null,null,null,null,1,4.25,5.5,0.78,0.78,0.78,0.78,0.24374999999999999,"--",0.24374999999999999,"--",0.78,4.75,4.75,4.75]
[null,null,null,null,null,null,null,null,null,null,null,null,null,null,null,null,null,null,1,4.25,5.5,0.8,0.8,0.8,0.8,0.25,"--",0.25,"--",0.8,5,5,5]
[null,null,null,null,null,null,null,null,null,null,null,null,null,null,null,null,null,null,1,4.25,5.5,0.82,0.82,0.82,0.82,0.25624999999999998,"--",0.25624999999999998,"--",0.82,5.25,5.25,5.25]
[null,null,null,null,null,null,null,null,null,null,null,null,null,null,null,null,null,null,1,4.25,5.5,0.84,0.84,0.84,0.84,0.26250000000000001,"--",0.26250000000000001,"--",0.84,5.5,5.5,5.5]
["                                                           PG1 Routing         PG2 Routing",null,null,null,null,null,null,null,null,null,null,null,null,null,null,null,null,null,1,4.25,5.5,0.86,0.86,0.86,0.86,0.26874999999999999,"--",0.26874999999999999,"--",0.86]
[null,null,null,null,null,null,"Buck 1",null,null,"ON",null,"OFF","Buck 1",null,null,null,null,null,1,4.25,5.5,0.88,0.88,0.88,0.88,0.27500000000000002,"--",0.27500000000000002,"--",0.88]
[null,null,null,null,null,null,"Buck 2",null,null,"OFF",null,"ON","Buck 2",null,null,null,null,null,1,4.25,5.5,0.9,0.9,0.9,0.9,0.28125,"--",0.28125,"--",0.9]
[null,null,null,null,null,null,"Buck 3",null,null,"OFF",null,"OFF","Buck 3",null,null,null,null,null,1,4.25,5.5,0.92,0.92,0.92,0.92,0.28749999999999998,"--",0.28749999999999998,"--",0.92]
[null,null,null,null,null,null,"Buck 4",null,null,"OFF",null,"OFF","Buck 4",null,null,null,null,null,1,4.25,5.5,0.94,0.94,0.94,0.94,0.29375000000000001,"--",0.29375000000000001,"--",0.94]
[null,null,null,null,null,null,"LDO",null,null,"OFF",null,"OFF","LDO",null,null,null,null,null,1,4.25,5.5,0.96,0.96,0.96,0.96,0.3,"--",0.3,"--",0.96]
[null,null,null,null,null,null,null,null,null,null,null,null,null,null,null,null,null,null,1,4.25,5.5,0.98,0.98,0.98,0.98,0.30625000000000002,"--",0.30625000000000002,"--",0.98]
[null,null,null,null,null,null,null,null,null,null,null,null,null,null,null,null,null,null,{"$f":" S51","v":1},4.25,5.5,1,1,1,1,0.3125,"--",0.3125,"--",1]
[null,null,null,null,null,null,null,null,null,null,null,null,null,null,null,null,null,null,1,4.25,5.5,1.02,1.02,1.02,1.02,0.31874999999999998,"--",0.31874999999999998,"--",1.02]
[null,null,null,null,null,null,null,null,null,null,null,null,null,null,null,null,null,null,1,4.25,5.5,1.04,1.04,1.04,1.04,0.32500000000000001,"--",0.32500000000000001,"--",1.04]
[null,null,null,null,null,null,null,null,null,null,null,null,null,null,null,null,null,null,1,4.25,5.5,1.06,1.06,1.06,1.06,0.33124999999999999,"--",0.33124999999999999,"--",1.06]
[null,null,null,null,null,null,null,null,null,null,null,null,null,null,null,null,null,null,1,4.25,5.5,1.08,1.08,1.08,1.08,0.33750000000000002,"--",0.33750000000000002,"--",1.08]
[null,null,null,null,null,null,null,null,null,null,null,null,null,null,null,null,null,null,1,4.25,5.5,1.1000000000000001,1.1000000000000001,1.1000000000000001,1.1000000000000001,0.34375,"--",0.34375,"--",1.1000000000000001]
[null,null,null,null,null,null,null,null,null,null,null,null,null,null,null,null,null,null,1,4.25,5.5,1.1200000000000001,1.1200000000000001,1.1200000000000001,1.1200000000000001,0.35,"--",0.35,"--",1.1200000000000001]
[null,null,null,null,null,null,null,null,null,null,null,null,null,null,null,null,null,null,1,4.25,5.5,1.1399999999999999,1.1399999999999999,1.1399999999999999,1.1399999999999999,0.35625000000000001,"--",0.35625000000000001,"--",1.1399999999999999]
[null,null,null,null,null,null,null,null,null,null,null,null,null,null,null,null,null,null,1,4.25,5.5,1.1599999999999999,1.1599999999999999,1.1599999999999999,1.1599999999999999,0.36249999999999999,"--",0.36249999999999999,"--",1.1599999999999999]
[null,null,null,null,null,null,null,null,null,null,null,null,null,null,null,null,null,null,1,4.25,5.5,1.18,1.18,1.18,1.18,0.36875000000000002,"--",0.36875000000000002,"--",1.18]
[null,null,null,null,null,null,null,null,null,null,null,null,null,null,null,null,null,null,1,4.25,5.5,1.2,1.2,1.2,1.2,0.375,"--",0.375,"--",1.2]
["Fault Action and Shudown Settings",null,null,null,null,null,null,null,null,null,null,null,null,null,null,null,null,null,1,4.25,5.5,1.22,1.22,1.22,1.22,0.38124999999999998,"--",0.38124999999999998,"--",1.22]
[null,null,null,null,null,null,"Chip Fault",null,null,"ON",null,null,null,null,null,null,null,null,1,null,5.5,1.24,"--",1.24,1.24,0.38750000000000001,"--",0.38750000000000001,"--",1.24]
[null,null,null,null,null,null,"Soft Off",null,null,"ON",null,null,null,null,null,null,null,null,1,null,5.5,1.26,"--",1.26,1.26,0.39374999999999999,"--",0.39374999999999999,"--",1.26]
[null,null,null,null,null,null,"70-Ohm Discharge",null,null,"ON",null,null,null,null,null,null,null,null,1,null,5.5,1.28,"--",1.28,1.28,0.4,"--",0.4,"--",1.28]
[null,null,null,null,null,null,null,null,null,null,null,null,null,null,null,null,null,null,1,null,5.5,1.3,{"$f":"IF(V67>(T67-0.8),\"--\",V67)","v":"--"},1.3,{"$f":"IF(X67<(U67*S67*0.12),\"--\",X67)","v":1.3},0.40625,{"$f":"IF(Z67<(U67*S67*0.12),\"--\",Z67)","v":"--"},0.40625,{"$f":"IF(AB67<(U67*S67*0.12),\"--\",AB67)","v":"--"},1.3]
[null,"MxL7704 Register Settings (Slave Address = 7'h2D) ",null,null,null,null,null,null,null,null,null,null,null,null,null,null,null,null,{"$f":" S67","v":1},null,5.5,1.32,"--",1.32,1.32,0.41249999999999998,"--",0.41249999999999998,"--",1.32]
[null,null,null,null,null,null,null,null,null,null,null,null,null,null,null,null,null,null,1,null,5.5,1.34,"--",1.34,1.34,0.41875000000000001,"--",0.41875000000000001,"--",1.34]
[null,null,null,null,null,"MXL7704 Registers",null,null,null,"Address (HEX)",null,null,"Data (HEX)",null,null,null,"Read From MXL7704(HEX)",null,1,null,5.5,1.36,"--",1.36,1.36,0.42499999999999999,"--",0.42499999999999999,"--",1.36]
[null,null,null,null,null,"Voltage LDO",null,null,null,10,null,null,{"$f":" RIGHT(\"0\"&DEC2HEX((J22*1000)/20),2)","v":"A7"},null,null,null,"A5",null,1,null,null,null,"--",1.38,1.38,0.43125000000000002,0.43125000000000002,0.43125000000000002,0.43125000000000002,1.38]
[null,null,null,null,null,"Voltage Buck 1",null,null,null,11,null,null,{"$f":" RIGHT(\"0\"&DEC2HEX((J17*1000)/20),2)","v":"AD"},null,null,null,"A5",null,1,null,null,null,{"$f":"IF(V72>(T72-0.8),\"--\",V72)","v":"--"},1.4,{"$f":"IF(X72<(U72*S72*0.12),\"--\",X72)","v":1.4},0.4375,{"$f":"IF(Z72<(U72*S72*0.12),\"--\",Z72)","v":0.4375},0.4375,{"$f":"IF(AB72<(U72*S72*0.12),\"--\",AB72)","v":0.4375},1.4]
[null,null,null,null,null,"Voltage Buck 2",null,null,null,12,null,null,{"$f":" RIGHT(\"0\"&IF(N18=\"\",DEC2HEX((J18*1000)/20),\"ERROR\"),2)","v":"5A"},null,null,null,"5A",null,1,null,null,null,"--",1.42,1.42,0.44374999999999998,0.44374999999999998,0.44374999999999998,0.44374999999999998,1.42]
[null,null,null,null,null,"Voltage Buck 3",null,null,null,13,null,null,{"$f":" RIGHT(\"0\"&IF(N19=\"\",DEC2HEX((J19*100000)/625),\"ERROR\"),2)","v":"F0"},null,null,null,"D8",null,1,null,null,null,"--",1.44,1.44,0.45,0.45,0.45,0.45,1.44]
[null,null,null,null,null,"Voltage Buck 4",null,null,null,14,null,null,{"$f":" RIGHT(\"0\"& IF(N20=\"\",DEC2HEX((J20*100000)/625),\"ERROR\"),2)","v":"90"},null,null,null,"C0",null,1,null,null,null,"--",1.46,1.46,0.45624999999999999,0.45624999999999999,0.45624999999999999,0.45624999999999999,1.46]
[null,null,null,null,null,"Buck Group ",null,null,null,15,null,null,{"$f":" RIGHT(\"0\"&DEC2HEX(J24 + J25*4 + J26*16 + J27*64),2)","v":"1E"},null,null,null,"F9",null,1,null,null,null,"--",1.48,1.48,0.46250000000000002,0.46250000000000002,0.46250000000000002,0.46250000000000002,1.48]
[null,null,null,null,null,"LDO Group/CH_EN",null,null,null,16,null,null,{"$f":" RIGHT(\"0\"&DEC2HEX(J29*64 + IF(L27=\"OFF\",0,1)*16 + IF(L26=\"OFF\",0,1)*8 + IF(L25=\"OFF\",0,1)*4 + IF(L24=\"OFF\",0,1)*2 + IF(L29=\"OFF\",0,1)),2)","v":"9F"},null,null,null,"1F",null,1,null,null,null,"--",1.5,1.5,0.46875,0.46875,0.46875,0.46875,1.5]
[null,null,null,null,null,"PG1 Routing",null,null,null,17,null,null,{"$f":" RIGHT(\"0\"&DEC2HEX(J31*64 + IF(J49=\"ON\",1,0)*16 + IF(J48=\"ON\",1,0)*8 + IF(J47=\"ON\",1,0)*4 + IF(J46=\"ON\",1,0)*2 + IF(J50=\"ON\",1,0)),2)","v":"42"},null,null,null,64,null,1,null,null,null,"--",1.52,1.52,0.47499999999999998,0.47499999999999998,0.47499999999999998,0.47499999999999998,1.52]
[null,null,null,null,null,"PG2 Routing",null,null,null,18,null,null,{"$f":" RIGHT(\"0\"&DEC2HEX(IF(L49=\"ON\",1,0)*16 + IF(L48=\"ON\",1,0)*8 + IF(L47=\"ON\",1,0)*4 + IF(L46=\"ON\",1,0)*2 + IF(L50=\"ON\",1,0)),2)","v":"04"},null,null,null,"1A",null,1,null,null,null,"--",1.54,1.54,0.48125000000000001,0.48125000000000001,0.48125000000000001,0.48125000000000001,1.54]
[null,null,null,null,null,"Fault Actions/Freq",null,null,null,19,null,null,{"$f":" RIGHT(\"0\"&DEC2HEX(IF(J64=\"ON\",1,0)*128 + IF(J65=\"ON\",1,0)*64 + IF(J66=\"ON\",1,0)*32 + (J15-0.6)*10),2)","v":"E4"},null,null,null,"E9",null,1,null,null,null,"--",1.56,1.56,0.48749999999999999,0.48749999999999999,0.48749999999999999,0.48749999999999999,1.56]
[null,null,null,null,null,null,null,null,null,null,null,null,null,null,null,null,null,null,1,null,null,null,"--",1.58,1.58,0.49375000000000002,0.49375000000000002,0.49375000000000002,0.49375000000000002,1.58]
[null,null,null,null,null,null,null,null,null,null,null,null,null,null,null,null,null,null,1,null,null,null,"--",1.6,1.6,0.5,0.5,0.5,0.5,1.6]
[{"$f":"MAX(IF(J24=0,IF(A87=\"OFF\",0,J17),0),IF(J25=0,IF(A88=\"OFF\",0,J18),0),IF(J26=0,IF(A89=\"OFF\",0,J19),0),IF(J27=0,IF(A90=\"OFF\",0,J20),0),IF(J29=0,IF(A91=\"OFF\",0,J22),0))","v":0.9},"Time (ms)",null,"VOUT1 (V)",null,"VOUT2 (V)",null,"LDO (V)",null,"VOUT3 (V)",null,"VOUT4 (V)",null,null,null,null,null,null,1,{"$f":" T82","v":0},{"$f":" U82","v":0},1.62,"--",1.62,1.62,0.50624999999999998,0.50624999999999998,0.50624999999999998,0.50624999999999998,1.62]
[{"$f":" MAX(IF(J24=1,IF(A87=\"OFF\",0,J17),0),IF(J25=1,IF(A88=\"OFF\",0,J18),0),IF(J26=1,IF(A89=\"OFF\",0,J19),0),IF(J27=1,IF(A90=\"OFF\",0,J20),0),IF(J29=1,IF(A91=\"OFF\",0,J22),0))","v":1.5},0,null,0,null,null,null,null,null,null,null,null,null,null,null,null,null,null,{"$f":" S83","v":1},0,0,1.64,"--",1.64,1.64,0.51249999999999996,0.51249999999999996,0.51249999999999996,0.51249999999999996,1.64]
[{"$f":" MAX(IF(J24=2,IF(A87=\"OFF\",0,J17),0),IF(J25=2,IF(A88=\"OFF\",0,J18),0),IF(J26=2,IF(A89=\"OFF\",0,J19),0),IF(J27=2,IF(A90=\"OFF\",0,J20),0),IF(J29=2,IF(A91=\"OFF\",0,J22),0))","v":3.46},{"$f":" IF(J24=0,4,IF(J24=1,4+A83+IF(A83=0,0,2),IF(J24=2,4+A83+IF(A83=0,0,2)+A84+IF(A84=0,0,2),4+A83+IF(A83=0,0,2)+A84+IF(A84=0,0,2)+A85+IF(A85=0,0,2))))","v":10.4},null,0,null,null,null,null,null,null,null,null,null,null,null,null,null,null,1,0,0,1.66,"--",1.66,1.66,0.51875000000000004,0.51875000000000004,0.51875000000000004,0.51875000000000004,1.66]
[{"$f":" MAX(IF(J24=3,IF(A87=\"OFF\",0,J17),0),IF(J25=3,IF(A88=\"OFF\",0,J18),0),IF(J26=3,IF(A89=\"OFF\",0,J19),0),IF(J27=3,IF(A90=\"OFF\",0,J20),0),IF(J29=3,IF(A91=\"OFF\",0,J22),0))","v":1.8},{"$f":" B85 + J17","v":13.86},null,{"$f":" IF(L24=\"OFF\",0,J17)","v":3.46},null,null,null,null,null,null,null,null,null,null,null,null,null,null,1,0,0,1.68,"--",1.68,1.68,0.52500000000000002,0.52500000000000002,0.52500000000000002,0.52500000000000002,1.68]
[{"$f":" L24","v":"ON"},25,null,{"$f":" D86","v":3.46},null,null,null,null,null,null,null,null,null,null,null,null,null,null,1,0,0,1.7,"--",1.7,1.7,0.53125,0.53125,0.53125,0.53125,1.7]
[{"$f":" IF(N18=\"\",L25,\"OFF\")","v":"ON"},0,null,null,null,0,null,null,null,null,null,null,null,null,null,null,null,null,1,0,0,1.72,"--",1.72,1.72,0.53749999999999998,0.53749999999999998,0.53749999999999998,0.53749999999999998,1.72]
[{"$f":" IF(N19=\"\",L26,\"OFF\")","v":"ON"},{"$f":" IF(J25=0,4,IF(J25=1,4+A83+IF(A83=0,0,2),IF(J25=2,4+A83+IF(A83=0,0,2)+A84+IF(A84=0,0,2),4+A83+IF(A83=0,0,2)+A84+IF(A84=0,0,2)+A85+IF(A85=0,0,2))))","v":15.86},null,null,null,0,null,null,null,null,null,null,null,null,null,null,null,null,1,0,0,1.74,"--",1.74,1.74,0.54374999999999996,0.54374999999999996,0.54374999999999996,0.54374999999999996,1.74]
[{"$f":" IF(N20=\"\",L27,\"OFF\")","v":"ON"},{"$f":" B89 + IF(N18=\"\",J18,0)","v":17.66},null,null,null,{"$f":" IF(L25=\"OFF\",0,IF(N18=\"\",J18,0))","v":1.8},null,null,null,null,null,null,null,null,null,null,null,null,1,0,0,1.76,"--",1.76,1.76,0.55000000000000004,0.55000000000000004,0.55000000000000004,0.55000000000000004,1.76]
[{"$f":"L29","v":"ON"},25,null,null,null,{"$f":" F90","v":1.8},null,null,null,null,null,null,null,null,null,null,null,null,1,0,0,1.78,"--",1.78,1.78,0.55625000000000002,0.55625000000000002,0.55625000000000002,0.55625000000000002,1.78]
["PG1",0,null,null,null,null,null,0,null,null,null,null,null,null,null,null,null,null,1,0,0,1.8,"--",1.8,1.8,0.5625,0.5625,0.5625,0.5625,1.8]
[{"$f":" IF(AND(A87=\"ON\",J46=\"ON\"),\"ON\",\"OFF\")","v":"ON"},{"$f":" IF(J29=0,4,IF(J29=1,4+A83+IF(A83=0,0,2),IF(J29=2,4+A83+IF(A83=0,0,2)+A84+IF(A84=0,0,2),4+A83+IF(A83=0,0,2)+A84+IF(A84=0,0,2)+A85+IF(A85=0,0,2))))","v":10.4},null,null,null,null,null,0,null,null,null,null,null,null,null,null,null,null,1,0,0,1.82,"--",1.82,1.82,0.56874999999999998,0.56874999999999998,0.56874999999999998,0.56874999999999998,1.82]
[{"$f":" IF(AND(A88=\"ON\",J47=\"ON\"),\"ON\",\"OFF\")","v":"OFF"},{"$f":" B93 + J22","v":13.74},null,null,null,null,null,{"$f":"IF(L29=\"OFF\",0,J22)","v":3.34},null,null,null,null,null,null,null,null,null,null,1,0,0,1.84,"--",1.84,1.84,0.57499999999999996,0.57499999999999996,0.57499999999999996,0.57499999999999996,1.84]
[{"$f":" IF(AND(A89=\"ON\",J48=\"ON\"),\"ON\",\"OFF\")","v":"OFF"},25,null,null,null,null,null,{"$f":" H94","v":3.34},null,null,null,null,null,null,null,null,null,null,1,0,0,1.86,"--",1.86,1.86,0.58125000000000004,0.58125000000000004,0.58125000000000004,0.58125000000000004,1.86]
[{"$f":" IF(AND(A90=\"ON\",J49=\"ON\"),\"ON\",\"OFF\")","v":"OFF"},0,null,null,null,null,null,null,null,0,null,null,null,null,null,null,null,null,1,0,0,1.88,"--",1.88,1.88,0.58750000000000002,0.58750000000000002,0.58750000000000002,0.58750000000000002,1.88]
[{"$f":" IF(AND(A91=\"ON\",J50=\"ON\"),\"ON\",\"OFF\")","v":"OFF"},{"$f":" IF(J26=0,4,IF(J26=1,4+A83+IF(A83=0,0,2),IF(J26=2,4+A83+IF(A83=0,0,2)+A84+IF(A84=0,0,2),4+A83+IF(A83=0,0,2)+A84+IF(A84=0,0,2)+A85+IF(A85=0,0,2))))","v":6.9},null,null,null,null,null,null,null,0,null,null,null,null,null,null,null,null,1,0,0,1.9,"--",1.9,1.9,0.59375,0.59375,0.59375,0.59375,1.9]
["PG2",{"$f":" B97 + IF(N19=\"\",J19,0)","v":8.4},null,null,null,null,null,null,null,{"$f":" IF(L26=\"OFF\",0,IF(N19=\"\",J19,0))","v":1.5},null,null,null,null,null,null,null,null,1,0,0,1.92,"--",1.92,1.92,0.6,0.6,0.6,0.6,1.92]
[{"$f":" IF(AND(A87=\"ON\",L46=\"ON\"),\"ON\",\"OFF\")","v":"OFF"},25,null,null,null,null,null,null,null,{"$f":" J98","v":1.5},null,null,null,null,null,null,null,null,1,0,0,1.94,"--",1.94,1.94,0.60624999999999996,0.60624999999999996,0.60624999999999996,0.60624999999999996,1.94]
[{"$f":" IF(AND(A88=\"ON\",L47=\"ON\"),\"ON\",\"OFF\")","v":"ON"},0,null,null,null,null,null,null,null,null,null,0,null,null,null,null,null,null,{"$f":" S99","v":1},0,0,1.96,"--",1.96,1.96,0.61250000000000004,0.61250000000000004,0.61250000000000004,0.61250000000000004,1.96]
[{"$f":" IF(AND(A89=\"ON\",L48=\"ON\"),\"ON\",\"OFF\")","v":"OFF"},{"$f":" IF(J27=0,4,IF(J27=1,4+A83+IF(A83=0,0,2),IF(J27=2,4+A83+IF(A83=0,0,2)+A84+IF(A84=0,0,2),4+A83+IF(A83=0,0,2)+A84+IF(A84=0,0,2)+A85+IF(A85=0,0,2))))","v":4},null,null,null,null,null,null,null,null,null,0,null,null,null,null,null,null,1,0,0,1.98,"--",1.98,1.98,0.61875000000000002,0.61875000000000002,0.61875000000000002,0.61875000000000002,1.98]
[{"$f":" IF(AND(A90=\"ON\",L49=\"ON\"),\"ON\",\"OFF\")","v":"OFF"},{"$f":" B101 + IF(N20=\"\",J20,0)","v":4.9000000000000004},null,null,null,null,null,null,null,null,null,{"$f":" IF(L27=\"OFF\",0,IF(N20=\"\",J20,0))","v":0.9},null,null,null,null,null,null,1,0,0,2,"--",2,2,0.625,0.625,0.625,0.625,2]
[{"$f":" IF(AND(A91=\"ON\",L50=\"ON\"),\"ON\",\"OFF\")","v":"OFF"},25,null,null,null,null,null,null,null,null,null,{"$f":" L102","v":0.9},null,null,null,null,null,null,1,0,0,2.02,"--",2.02,2.02,0.63124999999999998,0.63124999999999998,0.63124999999999998,0.63124999999999998,2.02]
[null,"Time (ms)",null,"PG1",null,"PG2",null,null,null,null,null,null,null,null,null,null,null,null,1,0,0,2.04,"--",2.04,2.04,0.63749999999999996,0.63749999999999996,0.63749999999999996,0.63749999999999996,2.04]
[null,0,null,0,null,null,null,null,null,null,null,null,null,null,null,null,null,null,1,0,0,2.06,"--",2.06,2.06,0.64375000000000004,0.64375000000000004,0.64375000000000004,0.64375000000000004,2.06]
["Author:peihuang@maxlinear.com",{"$f":" MAX(IF(A96=\"ON\",B102+2,0),IF(A95=\"ON\",B98+2,0),IF(A94=\"ON\",B90+2,0),IF(A93=\"ON\",B86+2,0),IF(A97=\"ON\",B94+2,0))","v":15.86},null,0,null,null,null,null,null,null,null,null,null,null,null,null,null,null,1,0,0,2.08,"--",2.08,2.08,0.65,0.65,0.65,0.65,2.08]
[null,{"$f":" B106","v":15.86},null,{"$f":" IF(B106=0,0,5)","v":5},null,null,null,null,null,null,null,null,null,null,null,null,null,null,1,0,0,2.1,"--",2.1,2.1,0.65625,0.65625,0.65625,0.65625,2.1]
[null,25,null,{"$f":" D107","v":5},null,null,null,null,null,null,null,null,null,null,null,null,null,null,1,0,0,2.12,"--",2.12,2.12,0.66249999999999998,0.66249999999999998,0.66249999999999998,0.66249999999999998,2.12]
[null,0,null,null,null,0,null,null,null,null,null,null,null,null,null,null,null,null,1,0,0,2.14,"--",2.14,2.14,0.66874999999999996,0.66874999999999996,0.66874999999999996,0.66874999999999996,2.14]
[null,{"$f":" MAX(IF(A102=\"ON\",B102+2,0),IF(A101=\"ON\",B98+2,0),IF(A100=\"ON\",B90+2,0),IF(A99=\"ON\",B86+2,0),IF(A103=\"ON\",B94+2,0))","v":19.66},null,null,null,0,null,null,null,null,null,null,null,null,null,null,null,null,1,0,0,2.16,"--",2.16,2.16,0.67500000000000004,0.67500000000000004,0.67500000000000004,0.67500000000000004,2.16]
[null,{"$f":" B110","v":19.66},null,null,null,{"$f":" IF(B110=0,0,5)","v":5},null,null,null,null,null,null,null,null,null,null,null,null,1,0,0,2.1800000000000002,"--",2.1800000000000002,2.1800000000000002,0.68125000000000002,0.68125000000000002,0.68125000000000002,0.68125000000000002,2.1800000000000002]
[null,25,null,null,null,{"$f":" F111","v":5},null,null,null,null,null,null,null,null,null,null,null,null,1,0,0,2.2000000000000002,"--",2.2000000000000002,2.2000000000000002,0.6875,0.6875,0.6875,0.6875,2.2000000000000002]
[null,null,null,null,null,null,null,null,null,null,null,null,null,null,null,null,null,null,1,0,0,2.2200000000000002,"--",2.2200000000000002,2.2200000000000002,0.69374999999999998,0.69374999999999998,0.69374999999999998,0.69374999999999998,2.2200000000000002]
[null,null,null,null,null,null,null,null,null,null,null,null,null,null,null,null,null,null,1,0,0,2.2400000000000002,"--",2.2400000000000002,2.2400000000000002,0.7,0.7,0.7,0.7,2.2400000000000002]
[null,null,null,null,null,null,null,null,null,null,null,null,null,null,null,null,null,null,1,0,0,2.2599999999999998,"--",2.2599999999999998,2.2599999999999998,0.70625000000000004,0.70625000000000004,0.70625000000000004,0.70625000000000004,2.2599999999999998]
[null,null,null,null,null,null,null,null,null,null,null,null,null,null,null,null,null,null,{"$f":" S115","v":1},0,0,2.2799999999999998,"--",2.2799999999999998,2.2799999999999998,0.71250000000000002,0.71250000000000002,0.71250000000000002,0.71250000000000002,2.2799999999999998]
[null,null,null,null,null,null,null,null,null,null,null,null,null,null,null,null,null,null,1,0,0,2.2999999999999998,"--",2.2999999999999998,2.2999999999999998,0.71875,0.71875,0.71875,0.71875,2.2999999999999998]
[null,null,null,null,null,null,null,null,null,null,null,null,null,null,null,null,null,null,1,0,0,2.3199999999999998,"--",2.3199999999999998,2.3199999999999998,0.72499999999999998,0.72499999999999998,0.72499999999999998,0.72499999999999998,2.3199999999999998]
["Author : peihuang@maxlinear.com",null,null,null,null,null,null,null,null,null,null,null,null,null,null,null,null,null,1,0,0,2.34,"--",2.34,2.34,0.73124999999999996,0.73124999999999996,0.73124999999999996,0.73124999999999996,2.34]
[null,null,null,null,null,null,null,null,null,null,null,null,null,null,null,null,null,null,1,0,0,2.36,"--",2.36,2.36,0.73750000000000004,0.73750000000000004,0.73750000000000004,0.73750000000000004,2.36]
[null,null,null,null,null,null,null,null,null,null,null,null,null,null,null,null,null,null,1,0,0,2.38,"--",2.38,2.38,0.74375000000000002,0.74375000000000002,0.74375000000000002,0.74375000000000002,2.38]
[null,null,null,null,null,null,null,null,null,null,null,null,null,null,null,null,null,null,1,0,0,2.4,"--",2.4,2.4,0.75,0.75,0.75,0.75,2.4]
[null,null,null,null,null,null,null,null,null,null,null,null,null,null,null,null,null,null,1,0,0,2.42,"--",2.42,2.42,0.75624999999999998,0.75624999999999998,0.75624999999999998,0.75624999999999998,2.42]
[null,null,null,null,null,null,null,null,null,null,null,null,null,null,null,null,null,null,1,0,0,2.44,"--",2.44,2.44,0.76249999999999996,0.76249999999999996,0.76249999999999996,0.76249999999999996,2.44]
[null,null,null,null,null,null,null,null,null,null,null,null,null,null,null,null,null,null,1,0,0,2.46,"--",2.46,2.46,0.76875000000000004,0.76875000000000004,0.76875000000000004,0.76875000000000004,2.46]
[null,null,null,null,null,null,null,null,null,null,null,null,null,null,null,null,null,null,1,0,0,2.48,"--",2.48,2.48,0.77500000000000002,0.77500000000000002,0.77500000000000002,0.77500000000000002,2.48]
[null,null,null,null,null,null,null,null,null,null,null,null,null,null,null,null,null,null,1,0,0,2.5,"--",2.5,2.5,0.78125,0.78125,0.78125,0.78125,2.5]
[null,null,null,null,null,null,null,null,null,null,null,null,null,null,null,null,null,null,1,0,0,2.52,"--",2.52,null,0.78749999999999998,0.78749999999999998,0.78749999999999998,0.78749999999999998,2.52]
[null,null,null,null,null,null,null,null,null,null,null,null,null,null,null,null,null,null,1,0,0,2.54,"--",2.54,null,0.79374999999999996,0.79374999999999996,0.79374999999999996,0.79374999999999996,2.54]
[null,null,null,null,null,null,null,null,null,null,null,null,null,null,null,null,null,null,1,0,0,2.56,"--",null,null,0.8,0.8,0.8,0.8,2.56]
[null,null,null,null,null,null,null,null,null,null,null,null,null,null,null,null,null,null,1,0,0,2.58,{"$f":"IF(V131>(T131-0.8),\"--\",V131)","v":"--"},null,null,0.80625000000000002,{"$f":"IF(Z131<(U131*S131*0.12),\"--\",Z131)","v":0.80625000000000002},0.80625000000000002,{"$f":"IF(AB131<(U131*S131*0.12),\"--\",AB131)","v":0.80625000000000002},2.58]
[null,null,null,null,null,null,null,null,null,null,null,null,null,null,null,null,null,null,{"$f":" S131","v":1},0,0,2.6,"--",null,null,0.8125,0.8125,0.8125,0.8125,2.6]
[null,null,null,null,null,null,null,null,null,null,null,null,null,null,null,null,null,null,1,0,0,2.62,"--",null,null,0.81874999999999998,0.81874999999999998,0.81874999999999998,0.81874999999999998,2.62]
[null,null,null,null,null,null,null,null,null,null,null,null,null,null,null,null,null,null,1,0,0,2.64,"--",null,null,0.82499999999999996,0.82499999999999996,0.82499999999999996,0.82499999999999996,2.64]
[null,null,null,null,null,null,null,null,null,null,null,null,null,null,null,null,null,null,1,0,0,2.66,"--",null,null,0.83125000000000004,0.83125000000000004,0.83125000000000004,0.83125000000000004,2.66]
[null,null,null,null,null,null,null,null,null,null,null,null,null,null,null,null,null,null,1,0,0,2.68,"--",null,null,0.83750000000000002,0.83750000000000002,0.83750000000000002,0.83750000000000002,2.68]
[null,null,null,null,null,null,null,null,null,null,null,null,null,null,null,null,null,null,1,0,0,2.7,"--",null,null,0.84375,0.84375,0.84375,0.84375,2.7]
[null,null,null,null,null,null,null,null,null,null,null,null,null,null,null,null,null,null,1,0,0,2.72,"--",null,null,0.85,0.85,0.85,0.85,2.72]
[null,null,null,null,null,null,null,null,null,null,null,null,null,null,null,null,null,null,1,0,0,2.74,"--",null,null,0.85624999999999996,0.85624999999999996,0.85624999999999996,0.85624999999999996,2.74]
[null,null,null,null,null,null,null,null,null,null,null,null,null,null,null,null,null,null,1,0,0,2.76,"--",null,null,0.86250000000000004,0.86250000000000004,0.86250000000000004,0.86250000000000004,2.76]
[null,null,null,null,null,null,null,null,null,null,null,null,null,null,null,null,null,null,1,0,0,2.78,"--",null,null,0.86875000000000002,0.86875000000000002,0.86875000000000002,0.86875000000000002,2.78]
[null,null,null,null,null,null,null,null,null,null,null,null,null,null,null,null,null,null,1,0,0,2.8,"--",null,null,0.875,0.875,0.875,0.875,2.8]
[null,null,null,null,null,null,null,null,null,null,null,null,null,null,null,null,null,null,1,0,0,2.82,"--",null,null,0.88124999999999998,0.88124999999999998,0.88124999999999998,0.88124999999999998,2.82]
[null,null,null,null,null,null,null,null,null,null,null,null,null,null,null,null,null,null,1,0,0,2.84,"--",null,null,0.88749999999999996,0.88749999999999996,0.88749999999999996,0.88749999999999996,2.84]
[null,null,null,null,null,null,null,null,null,null,null,null,null,null,null,null,null,null,1,0,0,2.86,"--",null,null,0.89375000000000004,0.89375000000000004,0.89375000000000004,0.89375000000000004,2.86]
[null,null,null,null,null,null,null,null,null,null,null,null,null,null,null,null,null,null,1,0,0,2.88,"--",null,null,0.9,0.9,0.9,0.9,2.88]
[null,null,null,null,null,null,null,null,null,null,null,null,null,null,null,null,null,null,1,0,0,2.9,"--",null,null,0.90625,0.90625,0.90625,0.90625,2.9]
[null,null,null,null,null,null,null,null,null,null,null,null,null,null,null,null,null,null,{"$f":" S147","v":1},0,0,2.92,"--",null,null,0.91249999999999998,0.91249999999999998,0.91249999999999998,0.91249999999999998,2.92]
[null,null,null,null,null,null,null,null,null,null,null,null,null,null,null,null,null,null,1,0,0,2.94,"--",null,null,0.91874999999999996,0.91874999999999996,0.91874999999999996,0.91874999999999996,2.94]
[null,null,null,null,null,null,null,null,null,null,null,null,null,null,null,null,null,null,1,0,0,2.96,"--",null,null,0.92500000000000004,0.92500000000000004,0.92500000000000004,0.92500000000000004,2.96]
[null,null,null,null,null,null,null,null,null,null,null,null,null,null,null,null,null,null,1,0,0,2.98,"--",null,null,0.93125000000000002,0.93125000000000002,0.93125000000000002,0.93125000000000002,2.98]
[null,null,null,null,null,null,null,null,null,null,null,null,null,null,null,null,null,null,1,0,0,3,"--",null,null,0.9375,0.9375,0.9375,0.9375,3]
[null,null,null,null,null,null,null,null,null,null,null,null,null,null,null,null,null,null,1,0,0,3.02,"--",null,null,0.94374999999999998,0.94374999999999998,0.94374999999999998,0.94374999999999998,3.02]
[null,null,null,null,null,null,null,null,null,null,null,null,null,null,null,null,null,null,1,0,0,3.04,"--",null,null,0.95,0.95,0.95,0.95,3.04]
[null,null,null,null,null,null,null,null,null,null,null,null,null,null,null,null,null,null,1,0,0,3.06,"--",null,null,0.95625000000000004,0.95625000000000004,0.95625000000000004,0.95625000000000004,3.06]
[null,null,null,null,null,null,null,null,null,null,null,null,null,null,null,null,null,null,1,0,0,3.08,"--",null,null,0.96250000000000002,0.96250000000000002,0.96250000000000002,0.96250000000000002,3.08]
[null,null,null,null,null,null,null,null,null,null,null,null,null,null,null,null,null,null,1,0,0,3.1,"--",null,null,0.96875,0.96875,0.96875,0.96875,3.1]
[null,null,null,null,null,null,null,null,null,null,null,null,null,null,null,null,null,null,1,0,0,3.12,"--",null,null,0.97499999999999998,0.97499999999999998,0.97499999999999998,0.97499999999999998,3.12]
[null,null,null,null,null,null,null,null,null,null,null,null,null,null,null,null,null,null,1,0,0,3.14,"--",null,null,0.98124999999999996,0.98124999999999996,0.98124999999999996,0.98124999999999996,3.14]
[null,null,null,null,null,null,null,null,null,null,null,null,null,null,null,null,null,null,1,0,0,3.16,"--",null,null,0.98750000000000004,0.98750000000000004,0.98750000000000004,0.98750000000000004,3.16]
[null,null,null,null,null,null,null,null,null,null,null,null,null,null,null,null,null,null,1,0,0,3.18,"--",null,null,0.99375000000000002,0.99375000000000002,0.99375000000000002,0.99375000000000002,3.18]
[null,null,null,null,null,null,null,null,null,null,null,null,null,null,null,null,null,null,1,0,0,3.2,"--",null,null,1,1,1,1,3.2]
[null,null,null,null,null,null,null,null,null,null,null,null,null,null,null,null,null,null,1,0,0,3.22,"--",null,null,1.0062500000000001,1.0062500000000001,1.0062500000000001,1.0062500000000001,3.22]
[null,null,null,null,null,null,null,null,null,null,null,null,null,null,null,null,null,null,{"$f":" S163","v":1},0,0,3.24,"--",null,null,1.0125,1.0125,1.0125,1.0125,3.24]
[null,null,null,null,null,null,null,null,null,null,null,null,null,null,null,null,null,null,1,0,0,3.26,"--",null,null,1.01875,1.01875,1.01875,1.01875,3.26]
[null,null,null,null,null,null,null,null,null,null,null,null,null,null,null,null,null,null,1,0,0,3.28,"--",null,null,1.0249999999999999,1.0249999999999999,1.0249999999999999,1.0249999999999999,3.28]
[null,null,null,null,null,null,null,null,null,null,null,null,null,null,null,null,null,null,1,0,0,3.3,"--",null,null,1.03125,1.03125,1.03125,1.03125,3.3]
[null,null,null,null,null,null,null,null,null,null,null,null,null,null,null,null,null,null,1,0,0,3.32,"--",null,null,1.0375000000000001,1.0375000000000001,1.0375000000000001,1.0375000000000001,3.32]
[null,null,null,null,null,null,null,null,null,null,null,null,null,null,null,null,null,null,1,0,0,3.34,"--",null,null,1.04375,1.04375,1.04375,1.04375,3.34]
[null,null,null,null,null,null,null,null,null,null,null,null,null,null,null,null,null,null,1,0,0,3.36,"--",null,null,1.05,1.05,1.05,1.05,3.36]
[null,null,null,null,null,null,null,null,null,null,null,null,null,null,null,null,null,null,1,0,0,3.38,"--",null,null,1.0562499999999999,1.0562499999999999,1.0562499999999999,1.0562499999999999,3.38]
[null,null,null,null,null,null,null,null,null,null,null,null,null,null,null,null,null,null,1,0,0,3.4,"--",null,null,1.0625,1.0625,1.0625,1.0625,3.4]
[null,null,null,null,null,null,null,null,null,null,null,null,null,null,null,null,null,null,1,0,0,3.42,"--",null,null,1.0687500000000001,1.0687500000000001,1.0687500000000001,1.0687500000000001,3.42]
[null,null,null,null,null,null,null,null,null,null,null,null,null,null,null,null,null,null,1,0,0,3.44,"--",null,null,1.075,1.075,1.075,1.075,3.44]
[null,null,null,null,null,null,null,null,null,null,null,null,null,null,null,null,null,null,1,0,0,3.46,"--",null,null,1.08125,1.08125,1.08125,1.08125,3.46]
[null,null,null,null,null,null,null,null,null,null,null,null,null,null,null,null,null,null,1,0,0,3.48,"--",null,null,1.0874999999999999,1.0874999999999999,1.0874999999999999,1.0874999999999999,3.48]
[null,null,null,null,null,null,null,null,null,null,null,null,null,null,null,null,null,null,1,0,0,3.5,"--",null,null,1.09375,1.09375,1.09375,1.09375,3.5]
[null,null,null,null,null,null,null,null,null,null,null,null,null,null,null,null,null,null,1,0,0,3.52,"--",null,null,1.1000000000000001,1.1000000000000001,1.1000000000000001,1.1000000000000001,3.52]
[null,null,null,null,null,null,null,null,null,null,null,null,null,null,null,null,null,null,1,0,0,3.54,"--",null,null,1.10625,1.10625,1.10625,1.10625,3.54]
[null,null,null,null,null,null,null,null,null,null,null,null,null,null,null,null,null,null,{"$f":" S179","v":1},0,0,3.56,"--",null,null,1.1125,1.1125,1.1125,1.1125,3.56]
[null,null,null,null,null,null,null,null,null,null,null,null,null,null,null,null,null,null,1,0,0,3.58,"--",null,null,1.1187499999999999,1.1187499999999999,1.1187499999999999,1.1187499999999999,3.58]
[null,null,null,null,null,null,null,null,null,null,null,null,null,null,null,null,null,null,1,0,0,3.6,"--",null,null,1.125,1.125,1.125,1.125,3.6]
[null,null,null,null,null,null,null,null,null,null,null,null,null,null,null,null,null,null,1,0,0,3.62,"--",null,null,1.1312500000000001,1.1312500000000001,1.1312500000000001,1.1312500000000001,3.62]
[null,null,null,null,null,null,null,null,null,null,null,null,null,null,null,null,null,null,1,0,0,3.64,"--",null,null,1.1375,1.1375,1.1375,1.1375,3.64]
[null,null,null,null,null,null,null,null,null,null,null,null,null,null,null,null,null,null,1,0,0,3.66,"--",null,null,1.14375,1.14375,1.14375,1.14375,3.66]
[null,null,null,null,null,null,null,null,null,null,null,null,null,null,null,null,null,null,1,0,0,3.68,"--",null,null,1.1499999999999999,1.1499999999999999,1.1499999999999999,1.1499999999999999,3.68]
[null,null,null,null,null,null,null,null,null,null,null,null,null,null,null,null,null,null,1,0,0,3.7,"--",null,null,1.15625,1.15625,1.15625,1.15625,3.7]
[null,null,null,null,null,null,null,null,null,null,null,null,null,null,null,null,null,null,1,0,0,3.72,"--",null,null,1.1625000000000001,1.1625000000000001,1.1625000000000001,1.1625000000000001,3.72]
[null,null,null,null,null,null,null,null,null,null,null,null,null,null,null,null,null,null,1,0,0,3.74,"--",null,null,1.16875,1.16875,1.16875,1.16875,3.74]
[null,null,null,null,null,null,null,null,null,null,null,null,null,null,null,null,null,null,1,0,0,3.76,"--",null,null,1.175,1.175,1.175,1.175,3.76]
[null,null,null,null,null,null,null,null,null,null,null,null,null,null,null,null,null,null,1,0,0,3.78,"--",null,null,1.1812499999999999,1.1812499999999999,1.1812499999999999,1.1812499999999999,3.78]
[null,null,null,null,null,null,null,null,null,null,null,null,null,null,null,null,null,null,1,0,0,3.8,"--",null,null,1.1875,1.1875,1.1875,1.1875,3.8]
[null,null,null,null,null,null,null,null,null,null,null,null,null,null,null,null,null,null,1,0,0,3.82,"--",null,null,1.1937500000000001,1.1937500000000001,1.1937500000000001,1.1937500000000001,3.82]
[null,null,null,null,null,null,null,null,null,null,null,null,null,null,null,null,null,null,1,0,0,3.84,"--",null,null,1.2,1.2,1.2,1.2,3.84]
[null,null,null,null,null,null,null,null,null,null,null,null,null,null,null,null,null,null,1,0,0,3.86,{"$f":"IF(V195>(T195-0.8),\"--\",V195)","v":"--"},null,null,1.20625,{"$f":"IF(Z195<(U195*S195*0.12),\"--\",Z195)","v":1.20625},1.20625,{"$f":"IF(AB195<(U195*S195*0.12),\"--\",AB195)","v":1.20625},3.86]
[null,null,null,null,null,null,null,null,null,null,null,null,null,null,null,null,null,null,{"$f":" S195","v":1},0,0,3.88,"--",null,null,1.2124999999999999,1.2124999999999999,1.2124999999999999,1.2124999999999999,3.88]
[null,null,null,null,null,null,null,null,null,null,null,null,null,null,null,null,null,null,1,0,0,3.9,"--",null,null,1.21875,1.21875,1.21875,1.21875,3.9]
[null,null,null,null,null,null,null,null,null,null,null,null,null,null,null,null,null,null,1,0,0,3.92,"--",null,null,1.2250000000000001,1.2250000000000001,1.2250000000000001,1.2250000000000001,3.92]
[null,null,null,null,null,null,null,null,null,null,null,null,null,null,null,null,null,null,1,0,0,3.94,"--",null,null,1.23125,1.23125,1.23125,1.23125,3.94]
[null,null,null,null,null,null,null,null,null,null,null,null,null,null,null,null,null,null,1,0,0,3.96,"--",null,null,1.2375,1.2375,1.2375,1.2375,3.96]
[null,null,null,null,null,null,null,null,null,null,null,null,null,null,null,null,null,null,1,0,0,3.98,"--",null,null,1.2437499999999999,1.2437499999999999,1.2437499999999999,1.2437499999999999,3.98]
[null,null,null,null,null,null,null,null,null,null,null,null,null,null,null,null,null,null,1,0,0,4,"--",null,null,1.25,1.25,1.25,1.25,4]
[null,null,null,null,null,null,null,null,null,null,null,null,null,null,null,null,null,null,1,0,0,4.0199999999999996,"--",null,null,1.2562500000000001,1.2562500000000001,1.2562500000000001,1.2562500000000001,4.0199999999999996]
[null,null,null,null,null,null,null,null,null,null,null,null,null,null,null,null,null,null,1,0,0,4.04,"--",null,null,1.2625,1.2625,1.2625,1.2625,4.04]
[null,null,null,null,null,null,null,null,null,null,null,null,null,null,null,null,null,null,1,0,0,4.0599999999999996,"--",null,null,1.26875,1.26875,1.26875,1.26875,4.0599999999999996]
[null,null,null,null,null,null,null,null,null,null,null,null,null,null,null,null,null,null,1,0,0,4.08,"--",null,null,1.2749999999999999,1.2749999999999999,1.2749999999999999,1.2749999999999999,4.08]
[null,null,null,null,null,null,null,null,null,null,null,null,null,null,null,null,null,null,1,0,0,4.0999999999999996,"--",null,null,1.28125,1.28125,1.28125,1.28125,4.0999999999999996]
[null,null,null,null,null,null,null,null,null,null,null,null,null,null,null,null,null,null,1,0,0,4.12,"--",null,null,1.2875000000000001,1.2875000000000001,1.2875000000000001,1.2875000000000001,4.12]
[null,null,null,null,null,null,null,null,null,null,null,null,null,null,null,null,null,null,1,0,0,4.1399999999999997,"--",null,null,1.29375,1.29375,1.29375,1.29375,4.1399999999999997]
[null,null,null,null,null,null,null,null,null,null,null,null,null,null,null,null,null,null,1,0,0,4.16,"--",null,null,1.3,1.3,1.3,1.3,4.16]
[null,null,null,null,null,null,null,null,null,null,null,null,null,null,null,null,null,null,1,0,0,4.18,"--",null,null,1.3062499999999999,1.3062499999999999,1.3062499999999999,1.3062499999999999,4.18]
[null,null,null,null,null,null,null,null,null,null,null,null,null,null,null,null,null,null,{"$f":" S211","v":1},0,0,4.2,"--",null,null,1.3125,1.3125,1.3125,1.3125,4.2]
[null,null,null,null,null,null,null,null,null,null,null,null,null,null,null,null,null,null,1,0,0,4.22,"--",null,null,1.3187500000000001,1.3187500000000001,1.3187500000000001,1.3187500000000001,4.22]
[null,null,null,null,null,null,null,null,null,null,null,null,null,null,null,null,null,null,1,0,0,4.24,"--",null,null,1.325,1.325,1.325,1.325,4.24]
[null,null,null,null,null,null,null,null,null,null,null,null,null,null,null,null,null,null,1,0,0,4.26,"--",null,null,1.33125,1.33125,1.33125,1.33125,4.26]
[null,null,null,null,null,null,null,null,null,null,null,null,null,null,null,null,null,null,1,0,0,4.28,"--",null,null,1.3374999999999999,1.3374999999999999,1.3374999999999999,1.3374999999999999,4.28]
[null,null,null,null,null,null,null,null,null,null,null,null,null,null,null,null,null,null,1,0,0,4.3,"--",null,null,1.34375,1.34375,1.34375,1.34375,4.3]
[null,null,null,null,null,null,null,null,null,null,null,null,null,null,null,null,null,null,1,0,0,4.32,"--",null,null,1.35,1.35,1.35,1.35,4.32]
[null,null,null,null,null,null,null,null,null,null,null,null,null,null,null,null,null,null,1,0,0,4.34,"--",null,null,1.35625,1.35625,1.35625,1.35625,4.34]
[null,null,null,null,null,null,null,null,null,null,null,null,null,null,null,null,null,null,1,0,0,4.3600000000000003,"--",null,null,1.3625,1.3625,1.3625,1.3625,4.3600000000000003]
[null,null,null,null,null,null,null,null,null,null,null,null,null,null,null,null,null,null,1,0,0,4.38,"--",null,null,1.3687499999999999,1.3687499999999999,1.3687499999999999,1.3687499999999999,4.38]
[null,null,null,null,null,null,null,null,null,null,null,null,null,null,null,null,null,null,1,0,0,4.4000000000000004,"--",null,null,1.375,1.375,1.375,1.375,4.4000000000000004]
[null,null,null,null,null,null,null,null,null,null,null,null,null,null,null,null,null,null,1,0,0,4.42,"--",null,null,1.3812500000000001,1.3812500000000001,1.3812500000000001,1.3812500000000001,4.42]
[null,null,null,null,null,null,null,null,null,null,null,null,null,null,null,null,null,null,1,0,0,4.4400000000000004,"--",null,null,1.3875,1.3875,1.3875,1.3875,4.4400000000000004]
[null,null,null,null,null,null,null,null,null,null,null,null,null,null,null,null,null,null,1,0,0,4.46,"--",null,null,1.39375,1.39375,1.39375,1.39375,4.46]
[null,null,null,null,null,null,null,null,null,null,null,null,null,null,null,null,null,null,1,0,0,4.4800000000000004,"--",null,null,1.4,1.4,1.4,1.4,4.4800000000000004]
[null,null,null,null,null,null,null,null,null,null,null,null,null,null,null,null,null,null,1,0,0,4.5,"--",null,null,1.40625,1.40625,1.40625,1.40625,4.5]
[null,null,null,null,null,null,null,null,null,null,null,null,null,null,null,null,null,null,{"$f":" S227","v":1},0,0,4.5199999999999996,"--",null,null,1.4125000000000001,1.4125000000000001,1.4125000000000001,1.4125000000000001,4.5199999999999996]
[null,null,null,null,null,null,null,null,null,null,null,null,null,null,null,null,null,null,1,0,0,4.54,"--",null,null,1.41875,1.41875,1.41875,1.41875,4.54]
[null,null,null,null,null,null,null,null,null,null,null,null,null,null,null,null,null,null,1,0,0,4.5599999999999996,"--",null,null,1.425,1.425,1.425,1.425,4.5599999999999996]
[null,null,null,null,null,null,null,null,null,null,null,null,null,null,null,null,null,null,1,0,0,4.58,"--",null,null,1.4312499999999999,1.4312499999999999,1.4312499999999999,1.4312499999999999,4.58]
[null,null,null,null,null,null,null,null,null,null,null,null,null,null,null,null,null,null,1,0,0,4.5999999999999996,"--",null,null,1.4375,1.4375,1.4375,1.4375,4.5999999999999996]
[null,null,null,null,null,null,null,null,null,null,null,null,null,null,null,null,null,null,1,0,0,4.62,"--",null,null,1.4437500000000001,1.4437500000000001,1.4437500000000001,1.4437500000000001,4.62]
[null,null,null,null,null,null,null,null,null,null,null,null,null,null,null,null,null,null,1,0,0,4.6399999999999997,"--",null,null,1.45,1.45,1.45,1.45,4.6399999999999997]
[null,null,null,null,null,null,null,null,null,null,null,null,null,null,null,null,null,null,1,0,0,4.66,"--",null,null,1.45625,1.45625,1.45625,1.45625,4.66]
[null,null,null,null,null,null,null,null,null,null,null,null,null,null,null,null,null,null,1,0,0,4.68,"--",null,null,1.4624999999999999,1.4624999999999999,1.4624999999999999,1.4624999999999999,4.68]
[null,null,null,null,null,null,null,null,null,null,null,null,null,null,null,null,null,null,1,0,0,4.7,"--",null,null,1.46875,1.46875,1.46875,1.46875,4.7]
[null,null,null,null,null,null,null,null,null,null,null,null,null,null,null,null,null,null,1,0,0,4.72,"--",null,null,1.4750000000000001,1.4750000000000001,1.4750000000000001,1.4750000000000001,4.72]
[null,null,null,null,null,null,null,null,null,null,null,null,null,null,null,null,null,null,1,0,0,4.74,"--",null,null,1.48125,1.48125,1.48125,1.48125,4.74]
[null,null,null,null,null,null,null,null,null,null,null,null,null,null,null,null,null,null,1,0,0,4.76,"--",null,null,1.4875,1.4875,1.4875,1.4875,4.76]
[null,null,null,null,null,null,null,null,null,null,null,null,null,null,null,null,null,null,1,0,0,4.78,"--",null,null,1.4937499999999999,1.4937499999999999,1.4937499999999999,1.4937499999999999,4.78]
[null,null,null,null,null,null,null,null,null,null,null,null,null,null,null,null,null,null,1,0,0,4.8,"--",null,null,1.5,1.5,1.5,1.5,4.8]
[null,null,null,null,null,null,null,null,null,null,null,null,null,null,null,null,null,null,1,0,0,4.82,"--",null,null,1.5062500000000001,1.5062500000000001,1.5062500000000001,1.5062500000000001,4.82]
[null,null,null,null,null,null,null,null,null,null,null,null,null,null,null,null,null,null,{"$f":" S243","v":1},0,0,4.84,"--",null,null,1.5125,1.5125,1.5125,1.5125,4.84]
[null,null,null,null,null,null,null,null,null,null,null,null,null,null,null,null,null,null,1,0,0,4.8600000000000003,"--",null,null,1.51875,1.51875,1.51875,1.51875,4.8600000000000003]
[null,null,null,null,null,null,null,null,null,null,null,null,null,null,null,null,null,null,1,0,0,4.88,"--",null,null,1.5249999999999999,1.5249999999999999,1.5249999999999999,1.5249999999999999,4.88]
[null,null,null,null,null,null,null,null,null,null,null,null,null,null,null,null,null,null,1,0,0,4.9000000000000004,"--",null,null,1.53125,1.53125,1.53125,1.53125,4.9000000000000004]
[null,null,null,null,null,null,null,null,null,null,null,null,null,null,null,null,null,null,1,0,0,4.92,"--",null,null,1.5375000000000001,1.5375000000000001,1.5375000000000001,1.5375000000000001,4.92]
[null,null,null,null,null,null,null,null,null,null,null,null,null,null,null,null,null,null,1,0,0,4.9400000000000004,"--",null,null,1.54375,1.54375,1.54375,1.54375,4.9400000000000004]
[null,null,null,null,null,null,null,null,null,null,null,null,null,null,null,null,null,null,1,0,0,4.96,"--",null,null,1.55,1.55,1.55,1.55,4.96]
[null,null,null,null,null,null,null,null,null,null,null,null,null,null,null,null,null,null,1,0,0,4.9800000000000004,"--",null,null,1.5562499999999999,1.5562499999999999,1.5562499999999999,1.5562499999999999,4.9800000000000004]
[null,null,null,null,null,null,null,null,null,null,null,null,null,null,null,null,null,null,1,0,0,5,"--",null,null,1.5625,1.5625,1.5625,1.5625,5]
[null,null,null,null,null,null,null,null,null,null,null,null,null,null,null,null,null,null,1,0,0,5.0199999999999996,"--",null,null,1.5687500000000001,1.5687500000000001,1.5687500000000001,1.5687500000000001,5.0199999999999996]
[null,null,null,null,null,null,null,null,null,null,null,null,null,null,null,null,null,null,1,0,0,5.04,"--",null,null,1.575,1.575,1.575,1.575,5.04]
[null,null,null,null,null,null,null,null,null,null,null,null,null,null,null,null,null,null,1,0,0,5.0599999999999996,"--",null,null,1.58125,1.58125,1.58125,1.58125,5.0599999999999996]
[null,null,null,null,null,null,null,null,null,null,null,null,null,null,null,null,null,null,1,0,0,5.08,"--",null,null,1.5874999999999999,1.5874999999999999,1.5874999999999999,1.5874999999999999,5.08]
[null,null,null,null,null,null,null,null,null,null,null,null,null,null,null,null,null,null,1,0,0,5.0999999999999996,"--",null,null,1.59375,1.59375,1.59375,1.59375,5.0999999999999996]

{"sheet":"Simple Data","index":1,"n_rows":1,"n_cols":4,"rows_kept":1,"cut":false,"hidden":false,"merged":[]}
["Date","Time","Millis","RandonValue"]

{"sheet":"PLXDAQ_new_Settings","index":2,"n_rows":18,"n_cols":5,"rows_kept":18,"cut":false,"hidden":true,"merged":[[2,4,17,5]]}
[]
[]
[null,"Previous Port:",4,null,"DO NOT CHANGE THIS LAYOUT OR THE MACRO WONT WORK ANYMORE !!!!"]
[null,"Previous Baud:",9600]
[null,"Rst on Connect?:",true]
[null,"Custom Checkbox 1",true]
[null,"Custom Checkbox 2",true]
[null,"Custom Checkbox 3",true]
[null,"Sheet name to use:","MxL7704"]
[null,"Log Incoming to DDW:",true]
[null,"Log Outgoing to DDW:",true]
[null,"Log System to DDW:",true]
[null,"Add Timestamp to DDW:",true]
[null,"Custom Form Width:",740.5]
[null,"#EXPERT-CONFIG# Serial Device Read buffer:",1024]
[null,"#EXPERT-CONFIG# Serial Device Write buffer:",1024]
[null,"#EXPERT-CONFIG# Excel Read buffer size:",1024]
[null,"#EXPERT-CONFIG# Excel interim buffer size:",64]